HBCCH2

Vibrational and/or electronic energy levels

Data compiled by: Marilyn E. Jacox

State:   X

Vib.
sym.
 No.   Approximate
 type of mode
 cm-1   Med.   Method   References

a1 2 BH stretch 2757.7 Ar IR Andrews, Lanzisera, et al., 1998
3 CC stretch 1859.8 Ar IR Andrews, Lanzisera, et al., 1998

Additional references: Jacox, 2003, page 313

References

Andrews, Lanzisera, et al., 1998
Andrews, L.; Lanzisera, D.V.; Hassanzadeh, P.; Hannachi, Y., Reactions of Laser-Ablated Boron Atoms with Ethylene and Ethane. Infrared Spectra and DFT Calculations for Several Novel BC, J. Phys. Chem. A, 1998, 102, 19, 3259, https://doi.org/10.1021/jp980437h . [all data]

Jacox, 2003
Jacox, M.E., Vibrational and electronic energy levels of polyatomic transient molecules: supplement B, J. Phys. Chem. Ref. Data, 2003, 32, 1, 1-441, https://doi.org/10.1063/1.1497629 . [all data]