cyc-(CH)2BH

Vibrational and/or electronic energy levels

Data compiled by: Marilyn E. Jacox

State:   X

Vib.
sym.
 No.   Approximate
 type of mode
 cm-1   Med.   Method   References

a1 2 BH stretch 2639.6 Ar IR Lanzisera, Hassanzadeh, et al., 1997
Andrews, Lanzisera, et al., 1998
4 Ring deform. 1175.3 Ar IR Lanzisera, Hassanzadeh, et al., 1997
Andrews, Lanzisera, et al., 1998
b1 7 Deformation 832.5 Ar IR Lanzisera, Hassanzadeh, et al., 1997
Andrews, Lanzisera, et al., 1998
8 653.0 Ar IR Lanzisera, Hassanzadeh, et al., 1997
Andrews, Lanzisera, et al., 1998
b2 10 1169.5 Ar IR Lanzisera, Hassanzadeh, et al., 1997
Andrews, Lanzisera, et al., 1998

Additional references: Jacox, 2003, page 312

References

Lanzisera, Hassanzadeh, et al., 1997
Lanzisera, D.V.; Hassanzadeh, P.; Hannachi, Y.; Andrews, L., Identification of the Borirene Molecule, (CH), J. Am. Chem. Soc., 1997, 119, 50, 12402, https://doi.org/10.1021/ja973094u . [all data]

Andrews, Lanzisera, et al., 1998
Andrews, L.; Lanzisera, D.V.; Hassanzadeh, P.; Hannachi, Y., Reactions of Laser-Ablated Boron Atoms with Ethylene and Ethane. Infrared Spectra and DFT Calculations for Several Novel BC, J. Phys. Chem. A, 1998, 102, 19, 3259, https://doi.org/10.1021/jp980437h . [all data]

Jacox, 2003
Jacox, M.E., Vibrational and electronic energy levels of polyatomic transient molecules: supplement B, J. Phys. Chem. Ref. Data, 2003, 32, 1, 1-441, https://doi.org/10.1063/1.1497629 . [all data]