HON=CHNCO

Vibrational and/or electronic energy levels

Data compiled by: Marilyn E. Jacox

State:   X

Vib.
sym.
 No.   Approximate
 type of mode
 cm-1   Med.   Method   References

OH stretch 3638 Ar IR Maier and Teles, 1987
NCO a-stretch 2276 Ar IR Maier and Teles, 1987
1646 Ar IR Maier and Teles, 1987
976 Ar IR Maier and Teles, 1987

Additional references: Jacox, 1994, page 381

References

Maier and Teles, 1987
Maier, G.; Teles, J.H., Isolierung und Photoisomerisierung von einfach substituierten Nitriloxiden, Angew. Chem., 1987, 99, 2, 152, https://doi.org/10.1002/ange.19870990221 . [all data]

Jacox, 1994
Jacox, M.E., Vibrational and electronic energy levels of polyatomic transient molecules, American Chemical Society, Washington, DC, 1994, 464. [all data]