cyc-HC=CHAl

Vibrational and/or electronic energy levels

Data compiled by: Marilyn E. Jacox

State:   X

Vib.
sym.
 No.   Approximate
 type of mode
 cm-1   Med.   Method   References

HCC deform. 609 Ar IR Burkholder and Andrews, 1993
Chertihin, Andrews, et al., 1994

Additional references: Jacox, 1998, page 276

References

Burkholder and Andrews, 1993
Burkholder, T.R.; Andrews, L., Matrix infrared spectra of aluminum, gallium, and indium complexes with acetylene, Inorg. Chem., 1993, 32, 11, 2491, https://doi.org/10.1021/ic00063a048 . [all data]

Chertihin, Andrews, et al., 1994
Chertihin, G.V.; Andrews, L.; Taylor, P.R., Reactions of Pulsed-Laser-Evaporated Al with C and C2H2. Infrared Spectra and CASSCF Calculations for AlC, Al2C, Al2C2, and AlC2H, J. Am. Chem. Soc., 1994, 116, 8, 3513, https://doi.org/10.1021/ja00087a043 . [all data]

Jacox, 1998
Jacox, M.E., Vibrational and electronic energy levels of polyatomic transient molecules: supplement A, J. Phys. Chem. Ref. Data, 1998, 27, 2, 115-393, https://doi.org/10.1063/1.556017 . [all data]