HCNC-

Vibrational and/or electronic energy levels

Data compiled by: Marilyn E. Jacox

State:   ?

 Energy
 (cm-1
 Med.   Transition   λmin
 (nm)
 λmax
 (nm)

References

Td = 15190 ± 105 gas Nimlos, Davico, et al., 2002

Nimlos, Davico, et al., 2002
Nimlos, M.R.; Davico, G.; Geise, C.M.; Wenthold, P.G.; Blanksby, W.C. Lineberger.S.J.; Hadad, C.M.; Petersson, G.A.; Ellison, G.B., Photoelectron spectroscopy of HCCN[sup -] and HCNC[sup -] reveals the quasilinear triplet carbenes, HCCN and HCNC, J. Chem. Phys., 2002, 117, 9, 4323, https://doi.org/10.1063/1.1496473 . [all data]