HFC=C:-

Vibrational and/or electronic energy levels

Data compiled by: Marilyn E. Jacox

State:   ?

 Energy
 (cm-1
 Med.   Transition   λmin
 (nm)
 λmax
 (nm)

References

Td = 13860 ± 50 gas Gilles, Lineberger, et al., 1993

State:   X

Vib.
sym.
 No.   Approximate
 type of mode
 cm-1   Med.   Method   References

a' CF stretch 710 ± 35 gas PE Gilles, Lineberger, et al., 1993
485 ± 30 gas PE Gilles, Lineberger, et al., 1993

Additional references: Jacox, 1994, page 168

Gilles, Lineberger, et al., 1993
Gilles, M.K.; Lineberger, W.C.; Ervin, K.M., Photoelectron Spectroscopy of the Monofluorovinylidene and Difluorovinylidene Anions: The Monofluorovinylidene-Fluoroacetylene Rearrangement, J. Am. Chem. Soc., 1993, 115, 3, 1031, https://doi.org/10.1021/ja00056a030 . [all data]

Jacox, 1994
Jacox, M.E., Vibrational and electronic energy levels of polyatomic transient molecules, American Chemical Society, Washington, DC, 1994, 464. [all data]