Cr(CO)2+

Vibrational and/or electronic energy levels

Data compiled by: Marilyn E. Jacox

State:   X

Vib.
sym.
 No.   Approximate
 type of mode
 cm-1   Med.   Method   References

b2 7 CO stretch 2178.1 Ne IR Andrews, Zhou, et al., 2003

References

Andrews, Zhou, et al., 2003
Andrews, L.; Zhou, M.; Gutsev, G.L.; Wang, X., Reactions of Laser-Ablated Chromium Atoms, Cations, and Electrons with CO in Excess Argon and Neon: Infrared Spectra and Density Functional Calculations on Neutral and Charged Unsaturated Chromium Carbonyls, J. Phys. Chem. A, 2003, 107, 4, 561, https://doi.org/10.1021/jp026955g . [all data]