Al2(CO)2

Vibrational and/or electronic energy levels

Data compiled by: Marilyn E. Jacox

State:   X

Vib.
sym.
 No.   Approximate
 type of mode
 cm-1   Med.   Method   References

b1u CO a-stretch 1727.9 Ne IR Kong, Chen, et al., 2002

References

Kong, Chen, et al., 2002
Kong, Q.; Chen, M.; Dong, J.; Li, Z.; Fan, K.; Zhou, M., Matrix Infrared Spectrum and Aromaticity of the Al, J. Phys. Chem. A, 2002, 106, 48, 11709, https://doi.org/10.1021/jp026351c . [all data]