cyc-Al2C2-

Vibrational and/or electronic energy levels

Data compiled by: Marilyn E. Jacox

State:   ?

 Energy
 (cm-1
 Med.   Transition   λmin
 (nm)
 λmax
 (nm)

References

Tdx = 12750 ± 400 gas Cannon, Boldyrev, et al., 2000

Additional references: Jacox, 2003, page 210

Cannon, Boldyrev, et al., 2000
Cannon, N.A.; Boldyrev, A.I.; Li, X.; Wang, L.-S., The electronic structure and chemical bonding of aluminum acetylide: Al[sub 2]C[sub 2] and Al[sub 2]C[sub 2][sup -]: An experimental and theoretical investigation, J. Chem. Phys., 2000, 113, 7, 2671, https://doi.org/10.1063/1.1305881 . [all data]

Jacox, 2003
Jacox, M.E., Vibrational and electronic energy levels of polyatomic transient molecules: supplement B, J. Phys. Chem. Ref. Data, 2003, 32, 1, 1-441, https://doi.org/10.1063/1.1497629 . [all data]