Al(CO)2-

Vibrational and/or electronic energy levels

Data compiled by: Marilyn E. Jacox

State:   X

Vib.
sym.
 No.   Approximate
 type of mode
 cm-1   Med.   Method   References

a1 1 CO s-stretch 1803.9 Ar IR Zhang, Dong, et al., 2000
b2 7 CO a-stretch 1741.0 Ar IR Zhang, Dong, et al., 2000

Additional references: Jacox, 2003, page 295

References

Zhang, Dong, et al., 2000
Zhang, L.; Dong, J.; Zhou, M.; Qin, Q., The AlCO[sup -] and Al(CO)[sub 2][sup -] anions: Matrix isolation infrared spectra and density functional theory studies, J. Chem. Phys., 2000, 113, 22, 10169, https://doi.org/10.1063/1.1322363 . [all data]

Jacox, 2003
Jacox, M.E., Vibrational and electronic energy levels of polyatomic transient molecules: supplement B, J. Phys. Chem. Ref. Data, 2003, 32, 1, 1-441, https://doi.org/10.1063/1.1497629 . [all data]