OTiCO+

Vibrational and/or electronic energy levels

Data compiled by: Marilyn E. Jacox

State:   X

Vib.
sym.
 No.   Approximate
 type of mode
 cm-1   Med.   Method   References

CO stretch 2190.4 Ar IR Zhou and Andrews, 1999
CO stretch 2185.5 Ar IR Zhou and Andrews, 1999
TiO stretch 1004.3 Ar IR Zhou and Andrews, 1999
TiO stretch 1003.0 Ar IR Zhou and Andrews, 1999

Additional references: Jacox, 2003, page 216

References

Zhou and Andrews, 1999
Zhou, M.; Andrews, L., Infrared Spectra and Density Functional Calculations for OMCO, OM-(η, J. Phys. Chem. A, 1999, 103, 13, 2066, https://doi.org/10.1021/jp9844009 . [all data]

Jacox, 2003
Jacox, M.E., Vibrational and electronic energy levels of polyatomic transient molecules: supplement B, J. Phys. Chem. Ref. Data, 2003, 32, 1, 1-441, https://doi.org/10.1063/1.1497629 . [all data]