OTaCO-

Vibrational and/or electronic energy levels

Data compiled by: Marilyn E. Jacox

State:   X

Vib.
sym.
 No.   Approximate
 type of mode
 cm-1   Med.   Method   References

CO stretch 1838.1 Ar IR Wang, Chen, et al., 2000

Additional references: Jacox, 2003, page 224

References

Wang, Chen, et al., 2000
Wang, X.-F.; Chen, M.-H.; Zhang, L.-N.; Qin, Q.-Z., Spectroscopic and Theoretical Studies on the Reactions of Laser-Ablated Tantalum with Carbon Dioxide, J. Phys. Chem. A, 2000, 104, 4, 758, https://doi.org/10.1021/jp9927808 . [all data]

Jacox, 2003
Jacox, M.E., Vibrational and electronic energy levels of polyatomic transient molecules: supplement B, J. Phys. Chem. Ref. Data, 2003, 32, 1, 1-441, https://doi.org/10.1063/1.1497629 . [all data]