OReCO-

Vibrational and/or electronic energy levels

Data compiled by: Marilyn E. Jacox

State:   X

Vib.
sym.
 No.   Approximate
 type of mode
 cm-1   Med.   Method   References

1 CO stretch 1771.1 Ne IR Liang and Andrews, 2002
1 CO stretch 1757.6 Ar IR Liang and Andrews, 2002
ReO stretch 930.2 Ne IR Liang and Andrews, 2002
ReO stretch 923.3 w Ar IR Liang and Andrews, 2002

References

Liang and Andrews, 2002
Liang, B.; Andrews, L., Reactions of Laser-Ablated Rhenium Atoms with Carbon Dioxide: Matrix Infrared Spectra and Density Functional Calculations on OReCO, O, J. Phys. Chem. A, 2002, 106, 4, 595, https://doi.org/10.1021/jp013184s . [all data]