ONbCO (I)

Vibrational and/or electronic energy levels

Data compiled by: Marilyn E. Jacox

State:   X

Vib.
sym.
 No.   Approximate
 type of mode
 cm-1   Med.   Method   References

a' 1 CO stretch 1902.6 Ar IR Chen, Wang, et al., 2000
2 NbO stretch 960.1 Ar IR Chen, Wang, et al., 2000

Additional references: Jacox, 2003, page 220

References

Chen, Wang, et al., 2000
Chen, M.; Wang, X.; Zhang, L.; Qin, Q., IR Spectroscopic and DFT Studies on the Reactions of Laser-Ablated Nb Atoms with Carbon Dioxide, J. Phys. Chem. A, 2000, 104, 30, 7010, https://doi.org/10.1021/jp000134z . [all data]

Jacox, 2003
Jacox, M.E., Vibrational and electronic energy levels of polyatomic transient molecules: supplement B, J. Phys. Chem. Ref. Data, 2003, 32, 1, 1-441, https://doi.org/10.1063/1.1497629 . [all data]