NOCN

Vibrational and/or electronic energy levels

Data compiled by: Marilyn E. Jacox

State:   X

Vib.
sym.
 No.   Approximate
 type of mode
 cm-1   Med.   Method   References

a' 1 CN stretch 2086.0 w Ar IR Maier, Reisenauer, et al., 1997
2 NO stretch 1841.1 Ne IR Thompson and Jacox, 2011
2 NO stretch 1836.9 vs Ar IR Maier, Reisenauer, et al., 1997
3 Bend 485.4 w Ar IR Maier, Reisenauer, et al., 1997

Additional references: Jacox, 2003, page 228

References

Maier, Reisenauer, et al., 1997
Maier, G.; Reisenauer, H.P.; Eckwert, J.; Naumann, M.; De Marco, M., Angew. Chem., 1997, 109, 1795. [all data]

Thompson and Jacox, 2011
Thompson, W.E.; Jacox, M.E., The infrared spectrum of NN...CO+ trapped in solid neon, J. Chem. Phys., 2011, 135, 22, 224307, https://doi.org/10.1063/1.3666046 . [all data]

Jacox, 2003
Jacox, M.E., Vibrational and electronic energy levels of polyatomic transient molecules: supplement B, J. Phys. Chem. Ref. Data, 2003, 32, 1, 1-441, https://doi.org/10.1063/1.1497629 . [all data]