SiCN

Vibrational and/or electronic energy levels

Data compiled by: Marilyn E. Jacox

State:   X

Vib.
sym.
 No.   Approximate
 type of mode
 cm-1   Med.   Method   References

Σ+ 1 CN stretch 2077.3 m Ar IR Maier, Reisenauer, et al.
3 SiC stretch 584.6 vs Ar IR Maier, Reisenauer, et al.

Additional references: Jacox, 2003, page 100; Apponi, McCarthy, et al., 2000; McCarthy, Apponi, et al., 2001

References

Maier, Reisenauer, et al.
Maier, G.; Reisenauer, H.P.; Egenolf, H.; Glatthaar, J., Eur. J. Org. Chem. 1998, 1307.. [all data]

Jacox, 2003
Jacox, M.E., Vibrational and electronic energy levels of polyatomic transient molecules: supplement B, J. Phys. Chem. Ref. Data, 2003, 32, 1, 1-441, https://doi.org/10.1063/1.1497629 . [all data]

Apponi, McCarthy, et al., 2000
Apponi, A.J.; McCarthy, M.C.; Gottlieb, C.A.; Thaddeus, P., The Radio Spectra of S[CLC]i[/CLC]CCH, S[CLC]i[/CLC]CN, and S[CLC]i[/CLC]NC, Astrophys. J., 2000, 536, 1, L55, https://doi.org/10.1086/312719 . [all data]

McCarthy, Apponi, et al., 2001
McCarthy, M.C.; Apponi, A.J.; Gottlieb, C.A.; Thaddeus, P., Rotational spectra of SiCN, SiNC, and the SiC[sub n]H (n=2, 4--6) radicals, J. Chem. Phys., 2001, 115, 2, 870, https://doi.org/10.1063/1.1370068 . [all data]