NCPO

Vibrational and/or electronic energy levels

Data compiled by: Marilyn E. Jacox

State:   X

Vib.
sym.
 No.   Approximate
 type of mode
 cm-1   Med.   Method   References

1 CN stretch 2165 gas IR Allaf, Kassem, et al., 1999
2 PO stretch 1385 gas IR Allaf, Kassem, et al., 1999

Additional references: Jacox, 2003, page 229

References

Allaf, Kassem, et al., 1999
Allaf, A.W.; Kassem, M.; Alibrahim, M.; Boustani, I., Gas-phase infrared spectrum of phosphorus (III) oxycyanide, OPCN: experimental and theoretical investigations, J. Mol. Struct., 1999, 478, 1-3, 193, https://doi.org/10.1016/S0022-2860(98)00747-9 . [all data]

Jacox, 2003
Jacox, M.E., Vibrational and electronic energy levels of polyatomic transient molecules: supplement B, J. Phys. Chem. Ref. Data, 2003, 32, 1, 1-441, https://doi.org/10.1063/1.1497629 . [all data]