OMoCO

Vibrational and/or electronic energy levels

Data compiled by: Marilyn E. Jacox

State:   X

Vib.
sym.
 No.   Approximate
 type of mode
 cm-1   Med.   Method   References

a' 1 CO stretch 1847.0 Ar IR Souter and Andrews, 1997
2 MoO stretch 951.8 Ar IR Souter and Andrews, 1997

Additional references: Jacox, 2003, page 221

References

Souter and Andrews, 1997
Souter, P.F.; Andrews, L., A Spectroscopic and Theoretical Study of the Reactions of Group 6 Metal Atoms with Carbon Dioxide, J. Am. Chem. Soc., 1997, 119, 31, 7350, https://doi.org/10.1021/ja971038n . [all data]

Jacox, 2003
Jacox, M.E., Vibrational and electronic energy levels of polyatomic transient molecules: supplement B, J. Phys. Chem. Ref. Data, 2003, 32, 1, 1-441, https://doi.org/10.1063/1.1497629 . [all data]