MoCO+

Vibrational and/or electronic energy levels

Data compiled by: Marilyn E. Jacox

State:   X

Vib.
sym.
 No.   Approximate
 type of mode
 cm-1   Med.   Method   References

1 CO stretch 2189.1 Ne IR Andrews, Zhou, et al., 2003

References

Andrews, Zhou, et al., 2003
Andrews, L.; Zhou, M.; Gutsev, G.L., Reactions of Laser-Ablated Mo and W Atoms, Cations, and Electrons with CO in Excess Neon: Infrared Spectra and Density Functional Calculations on Neutral and Charged Unsaturated Metal Carbonyls, J. Phys. Chem. A, 2003, 107, 7, 990, https://doi.org/10.1021/jp026978v . [all data]