OMnCO-

Vibrational and/or electronic energy levels

Data compiled by: Marilyn E. Jacox

State:   X

Vib.
sym.
 No.   Approximate
 type of mode
 cm-1   Med.   Method   References

CO stretch 1810.0 Ar IR Zhou, Liang, et al., 1999
MnO stretch 810.1 Ar IR Zhou, Liang, et al., 1999

Additional references: Jacox, 2003, page 224

References

Zhou, Liang, et al., 1999
Zhou, M.; Liang, B.; Andrews, L., Nonexponentialities in the Ultrafast Electron-Transfer Dynamics in the System Oxazine 1 in, J. Phys. Chem. A, 1999, 103, 16, 3013, https://doi.org/10.1021/jp9843712 . [all data]

Jacox, 2003
Jacox, M.E., Vibrational and electronic energy levels of polyatomic transient molecules: supplement B, J. Phys. Chem. Ref. Data, 2003, 32, 1, 1-441, https://doi.org/10.1063/1.1497629 . [all data]