CH3InH

Vibrational and/or electronic energy levels

Data compiled by: Marilyn E. Jacox

State:   X

Vib.
sym.
 No.   Approximate
 type of mode
 cm-1   Med.   Method   References

a' 3 InH stretch 1545.9 Ar IR Himmel, Downs, et al., 1999
Himmel, Downs, et al., 2000
6 CH3 rock 697.3 Ar IR Himmel, Downs, et al., 1999
Himmel, Downs, et al., 2000

Additional references: Jacox, 2003, page 310

References

Himmel, Downs, et al., 1999
Himmel, H.-J.; Downs, A.J.; Greene, T.M.; Andrews, L., Chem. Commun., 1999, 2243. [all data]

Himmel, Downs, et al., 2000
Himmel, H.-J.; Downs, A.J.; Greene, T.M.; Andrews, L., Matrix Photochemistry of Gallium and Indium Atoms (M) in the Presence of Methane: Formation and Characterization of the Divalent Species CH, Organomet., 2000, 19, 6, 1060, https://doi.org/10.1021/om990905p . [all data]

Jacox, 2003
Jacox, M.E., Vibrational and electronic energy levels of polyatomic transient molecules: supplement B, J. Phys. Chem. Ref. Data, 2003, 32, 1, 1-441, https://doi.org/10.1063/1.1497629 . [all data]