CH3GeH

Vibrational and/or electronic energy levels

Data compiled by: Marilyn E. Jacox

State:   X

Vib.
sym.
 No.   Approximate
 type of mode
 cm-1   Med.   Method   References

a' 3 GeH stretch 1798.6 Ar IR Khabashesku, Kudin, et al., 1998
5 CH3 rock 1201.2 Ar IR Khabashesku, Kudin, et al., 1998
6 Deformation 868.8 Ar IR Khabashesku, Kudin, et al., 1998
a 8 CH stretch 2891.6 Ar IR Khabashesku, Kudin, et al., 1998
11 GeC stretch 535.6 Ar IR Khabashesku, Kudin, et al., 1998

Additional references: Jacox, 2003, page 312

References

Khabashesku, Kudin, et al., 1998
Khabashesku, V.N.; Kudin, K.N.; Tamas, J.; Boganov, S.E.; Margrave, J.L.; Nefedov, O.M., Transient 1,1-Dimethyl-1-germene, (CH, J. Am. Chem. Soc., 1998, 120, 20, 5005, https://doi.org/10.1021/ja971134o . [all data]

Jacox, 2003
Jacox, M.E., Vibrational and electronic energy levels of polyatomic transient molecules: supplement B, J. Phys. Chem. Ref. Data, 2003, 32, 1, 1-441, https://doi.org/10.1063/1.1497629 . [all data]