ZnCH3+

Vibrational and/or electronic energy levels

Data compiled by: Marilyn E. Jacox

State:   X

Vib.
sym.
 No.   Approximate
 type of mode
 cm-1   Med.   Method   References

a1 2 CH3 umbrella 1109 gas TPE Barckholtz, Powers, et al., 1999
3 ZnC stretch 482 gas TPE Barckholtz, Powers, et al., 1999
e 6 HCZn deform. 760 gas TPE Barckholtz, Powers, et al., 1999

Additional references: Jacox, 2003, page 247

References

Barckholtz, Powers, et al., 1999
Barckholtz, T.A.; Powers, D.E.; Miller, T.A.; Bursten, B.E., ZEKE Spectroscopy of the Organometallic Radicals MgCH, J. Am. Chem. Soc., 1999, 121, 11, 2576, https://doi.org/10.1021/ja9832461 . [all data]

Jacox, 2003
Jacox, M.E., Vibrational and electronic energy levels of polyatomic transient molecules: supplement B, J. Phys. Chem. Ref. Data, 2003, 32, 1, 1-441, https://doi.org/10.1063/1.1497629 . [all data]