CH3FSi

Vibrational and/or electronic energy levels

Data compiled by: Marilyn E. Jacox

State:   B

 Energy
 (cm-1
 Med.   Transition   λmin
 (nm)
 λmax
 (nm)

References

Tx = 41670 Ar Maier, Glatthaar, et al., 2003

State:   A

 Energy
 (cm-1
 Med.   Transition   λmin
 (nm)
 λmax
 (nm)

Tx = 27780 Ar Maier, Glatthaar, et al., 2003

State:   X

Vib.
sym.
 No.   Approximate
 type of mode
 cm-1   Med.   Method   References

1 CH3 stretch 3040.0 w Ar IR Maier, Glatthaar, et al., 2003
2 CH3 stretch 3040.0 w Ar IR Maier, Glatthaar, et al., 2003
3 CH3 s-stretch 2968.7 m Ar IR Maier, Glatthaar, et al., 2003
4 CH3 deform. 1450.9 w Ar IR Maier, Glatthaar, et al., 2003
5 CH3 deform. 1443.5 m Ar IR Maier, Glatthaar, et al., 2003
9 CF stretch 960.7 vs Ar IR Maier, Glatthaar, et al., 2003

Maier, Glatthaar, et al., 2003
Maier, G.; Glatthaar, J.; Reisenauer, H.P., Dihalodimethylsilanes from silicon atoms and methyl halides: a combined matrix-spectroscopic and density functional theory study, J. Organomet. Chem., 2003, 686, 1-2, 341, https://doi.org/10.1016/S0022-328X(03)00673-9 . [all data]