CH3ClSi

Vibrational and/or electronic energy levels

Data compiled by: Marilyn E. Jacox

State:   B

 Energy
 (cm-1
 Med.   Transition   λmin
 (nm)
 λmax
 (nm)

References

Tx = 38460 Ar Maier, Glatthaar, et al., 2003

State:   A

 Energy
 (cm-1
 Med.   Transition   λmin
 (nm)
 λmax
 (nm)

Tx = 30300 Ar Maier, Glatthaar, et al., 2003

State:   X

Vib.
sym.
 No.   Approximate
 type of mode
 cm-1   Med.   Method   References

4 CH3 deform. 1433.2 w Ar IR Maier, Glatthaar, et al., 2003
5 CH3 deform. 1428.7 w Ar IR Maier, Glatthaar, et al., 2003
6 CH3 s-deform. 1334.3 w Ar IR Maier, Glatthaar, et al., 2003
8 CH3 rock 1011.8 w Ar IR Maier, Glatthaar, et al., 2003
9 CCl stretch 679.1 w Ar IR Maier, Glatthaar, et al., 2003

Maier, Glatthaar, et al., 2003
Maier, G.; Glatthaar, J.; Reisenauer, H.P., Dihalodimethylsilanes from silicon atoms and methyl halides: a combined matrix-spectroscopic and density functional theory study, J. Organomet. Chem., 2003, 686, 1-2, 341, https://doi.org/10.1016/S0022-328X(03)00673-9 . [all data]