CH3SCl+

Vibrational and/or electronic energy levels

Data compiled by: Marilyn E. Jacox

State:   X

Vib.
sym.
 No.   Approximate
 type of mode
 cm-1   Med.   Method   References

631 ± 60 gas PI Cheng, Chew, et al., 1999

Additional references: Jacox, 2003, page 320

References

Cheng, Chew, et al., 1999
Cheng, B.-M.; Chew, E.P.; Liu, C.-P.; Yu, J.-S.K.; Yu, C.-H., H. Chem. Phys., 1999, 110, 4757. [all data]

Jacox, 2003
Jacox, M.E., Vibrational and electronic energy levels of polyatomic transient molecules: supplement B, J. Phys. Chem. Ref. Data, 2003, 32, 1, 1-441, https://doi.org/10.1063/1.1497629 . [all data]