CH3MgCl

Vibrational and/or electronic energy levels

Data compiled by: Marilyn E. Jacox

State:   X

Vib.
sym.
 No.   Approximate
 type of mode
 cm-1   Med.   Method   References

a1 1 CH3 s-stretch 2910.4 Ar IR Bare and Andrews, 1998
2 CH3 s-deform. 1127.5 Ar IR Bare and Andrews, 1998
3 CMgCl a-stretch 627.1 Ar IR Bare and Andrews, 1998
e 5 CH3 a-stretch 2951.3 Ar IR Bare and Andrews, 1998
7 CH3 rock 556.6 Ar IR Bare and Andrews, 1998

Additional references: Jacox, 2003, page 318

References

Bare and Andrews, 1998
Bare, W.D.; Andrews, L., Formation of Grignard Species from the Reaction of Methyl Halides with Laser-Ablated Magnesium Atoms. A Matrix Infrared Study of CH, J. Am. Chem. Soc., 1998, 120, 29, 7293, https://doi.org/10.1021/ja980806n . [all data]

Jacox, 2003
Jacox, M.E., Vibrational and electronic energy levels of polyatomic transient molecules: supplement B, J. Phys. Chem. Ref. Data, 2003, 32, 1, 1-441, https://doi.org/10.1063/1.1497629 . [all data]