HCBeH

Vibrational and/or electronic energy levels

Data compiled by: Marilyn E. Jacox

State:   X

Vib.
sym.
 No.   Approximate
 type of mode
 cm-1   Med.   Method   References

Σ+ 2 BeH stretch 2087.3 Ar IR Greene, Lanzisera, et al., 1998
3 CBe stretch 983.7 Ar IR Greene, Lanzisera, et al., 1998
Π 4 Deformation 534.2 Ar IR Greene, Lanzisera, et al., 1998

Additional references: Jacox, 2003, page 162

References

Greene, Lanzisera, et al., 1998
Greene, T.M.; Lanzisera, D.V.; Andrews, L.; Downs, A.J., A Matrix-Isolation and Density Functional Theory Study of the Reactions of Laser-Ablated Beryllium, Magnesium, and Calcium Atoms with Methane, J. Am. Chem. Soc., 1998, 120, 24, 6097, https://doi.org/10.1021/ja9804870 . [all data]

Jacox, 2003
Jacox, M.E., Vibrational and electronic energy levels of polyatomic transient molecules: supplement B, J. Phys. Chem. Ref. Data, 2003, 32, 1, 1-441, https://doi.org/10.1063/1.1497629 . [all data]