H2CBF

Vibrational and/or electronic energy levels

Data compiled by: Marilyn E. Jacox

State:   X

Vib.
sym.
 No.   Approximate
 type of mode
 cm-1   Med.   Method   References

a1 1 CH2 s-stretch 3050.2 Ar IR Lanzisera and Andrews, 2000
2 1762.2 Ar IR Lanzisera and Andrews, 2000
917.4 Ar IR Lanzisera and Andrews, 2000
b1 755.0 Ar IR Lanzisera and Andrews, 2000
b2 589.5 Ar IR Lanzisera and Andrews, 2000

Additional references: Jacox, 2003, page 266

References

Lanzisera and Andrews, 2000
Lanzisera, D.V.; Andrews, L., Reactions of Laser-Ablated Boron Atoms with Methyl Halides in Excess Argon. Infrared Spectra and Density Functional Theory Calculations on CH, J. Phys. Chem. A, 2000, 104, 41, 9295, https://doi.org/10.1021/jp0017689 . [all data]

Jacox, 2003
Jacox, M.E., Vibrational and electronic energy levels of polyatomic transient molecules: supplement B, J. Phys. Chem. Ref. Data, 2003, 32, 1, 1-441, https://doi.org/10.1063/1.1497629 . [all data]