HCS2

Vibrational and/or electronic energy levels

Data compiled by: Marilyn E. Jacox

State:   X

Vib.
sym.
 No.   Approximate
 type of mode
 cm-1   Med.   Method   References

1252.9 T Ar IR Bohn, Brabson, et al., 1992
1004.5 T Ar IR Bohn, Brabson, et al., 1992

Additional references: Jacox, 1994, page 168

References

Bohn, Brabson, et al., 1992
Bohn, R.B.; Brabson, G.D.; Andrews, L., Reaction of atomic hydrogen and carbon disulfide: infrared spectra of HSCS and HSHCS in solid argon, J. Phys. Chem., 1992, 96, 4, 1582, https://doi.org/10.1021/j100183a019 . [all data]

Jacox, 1994
Jacox, M.E., Vibrational and electronic energy levels of polyatomic transient molecules, American Chemical Society, Washington, DC, 1994, 464. [all data]