t-HSCO

Vibrational and/or electronic energy levels

Data compiled by: Marilyn E. Jacox

State:   X

Vib.
sym.
 No.   Approximate
 type of mode
 cm-1   Med.   Method   References

a' 2 CO stretch 1823.3 Ar IR Lo, Chen, et al., 2004
3 HSC bend 931.6 Ar IR Lo, Chen, et al., 2004
4 CS stretch 553.3 Ar IR Lo, Chen, et al., 2004

References

Lo, Chen, et al., 2004
Lo, W.-J.; Chen, H.-F.; Wu, Y.-J.; Lee, Y.-P., Isomers of HSCO: IR absorption spectra of t-HSCO in solid Ar, J. Chem. Phys., 2004, 120, 12, 5717, https://doi.org/10.1063/1.1648634 . [all data]