HXeNC

Vibrational and/or electronic energy levels

Data compiled by: Marilyn E. Jacox

State:   X

Vib.
sym.
 No.   Approximate
 type of mode
 cm-1   Med.   Method   References

Σ+ 1 NC stretch 2048.5 Kr IR Pettersson, Lundell, et al., 1998
1 NC stretch 2043.8 Xe IR Pettersson, Lundell, et al., 1998
2 XeH stretch 1878 Kr IR Pettersson, Lundell, et al., 1998
2 XeH stretch 1851.0 Xe IR Pettersson, Lundell, et al., 1998
Pettersson, Khriachtchev, et al., 1999
Ahokas, Vaskonen, et al., 2000

Additional references: Jacox, 2003, page 196

References

Pettersson, Lundell, et al., 1998
Pettersson, M.; Lundell, J.; Khriachtchev, L.; Rasanen, M., Neutral rare-gas containing charge-transfer molecules in solid matrices. III. HXeCN, HXeNC, and HKrCN in Kr and Xe, J. Chem. Phys., 1998, 109, 2, 618, https://doi.org/10.1063/1.476599 . [all data]

Pettersson, Khriachtchev, et al., 1999
Pettersson, M.; Khriachtchev, L.; Jolkkonen, S.; Rasanen, M., Photochemistry of HNCO in Solid Xe: Channels of UV Photolysis and Creation of H, J. Phys. Chem. A, 1999, 103, 45, 9154, https://doi.org/10.1021/jp992224d . [all data]

Ahokas, Vaskonen, et al., 2000
Ahokas, J.; Vaskonen, K.; Eloranta, J.; Kunttu, H., Electronic Absorption Spectra of HXeCl, HXeBr, HXeI, and HXeCN in Xe Matrix, J. Phys. Chem. A, 2000, 104, 42, 9506, https://doi.org/10.1021/jp002141t . [all data]

Jacox, 2003
Jacox, M.E., Vibrational and electronic energy levels of polyatomic transient molecules: supplement B, J. Phys. Chem. Ref. Data, 2003, 32, 1, 1-441, https://doi.org/10.1063/1.1497629 . [all data]