HSiNC

Vibrational and/or electronic energy levels

Data compiled by: Marilyn E. Jacox

State:   A

 Energy
 (cm-1
 Med.   Transition   λmin
 (nm)
 λmax
 (nm)

References

To = 19950.58 gas A-X 420 520 Evans and Dover, 2009

Vib.
sym.
 No.   Approximate
 type of mode
 cm-1   Med.   Method   References

a' 3 694.65 gas LF Evans and Dover, 2009

State:   X

Vib.
sym.
 No.   Approximate
 type of mode
 cm-1   Med.   Method   References

a' 1 NC stretch 2039.5 s Ar IR Maier, Reisenauer, et al.
2 SiH stretch 2017.8 vs Ar IR Maier, Reisenauer, et al.
3 SiH deform. 857.07 gas LF Evans and Dover, 2009
3 SiH deform. 867.9 m Ar IR Maier, Reisenauer, et al.
4 SiN stretch 622.0 m Ar IR Maier, Reisenauer, et al.

Additional references: Jacox, 2003, page 187; Sanz, McCarthy, et al., 2002

Evans and Dover, 2009
Evans, C.J.; Dover, M.R., Spectroscopic Investigation of the Electronic A, J. Phys. Chem. A, 2009, 113, 30, 8533, https://doi.org/10.1021/jp902966y . [all data]

Maier, Reisenauer, et al.
Maier, G.; Reisenauer, H.P.; Egenolf, H.; Glatthaar, J., Eur. J. Org. Chem. 1998, 1307.. [all data]

Jacox, 2003
Jacox, M.E., Vibrational and electronic energy levels of polyatomic transient molecules: supplement B, J. Phys. Chem. Ref. Data, 2003, 32, 1, 1-441, https://doi.org/10.1063/1.1497629 . [all data]

Sanz, McCarthy, et al., 2002
Sanz, M.E.; McCarthy, M.C.; Thaddeus, P., Laboratory Detection of HS[CLC]i[/CLC]CN and HS[CLC]i[/CLC]NC, Astrophys. J., 2002, 577, 1, L71, https://doi.org/10.1086/344083 . [all data]