HPCN

Vibrational and/or electronic energy levels

Data compiled by: Marilyn E. Jacox

State:   ?

 Energy
 (cm-1
 Med.   Transition   λmin
 (nm)
 λmax
 (nm)

References

gas 314 338 Basco and Yee, 1968

Additional references: Jacox, 1994, page 160

Basco and Yee, 1968
Basco, N.; Yee, K.K., Chem. Commun., 1968, 150. [all data]

Jacox, 1994
Jacox, M.E., Vibrational and electronic energy levels of polyatomic transient molecules, American Chemical Society, Washington, DC, 1994, 464. [all data]