CCl3OH

Vibrational and/or electronic energy levels

Data compiled by: Marilyn E. Jacox

State:   X

Vib.
sym.
 No.   Approximate
 type of mode
 cm-1   Med.   Method   References

OH stretch 3604 gas IR Wallington, Schneider, et al., 2000
COH bend 1311 gas IR Wallington, Schneider, et al., 2000
CO stretch 1113 gas IR Wallington, Schneider, et al., 2000
CCl3 stretch 784 gas IR Wallington, Schneider, et al., 2000

Additional references: Jacox, 2003, page 324

References

Wallington, Schneider, et al., 2000
Wallington, T.J.; Schneider, W.F.; Barnes, I.; Becker, K.H.; Sehested, J.; Nielsen, O.J., Stability and infrared spectra of mono-, di-, and trichloromethanol, Chem. Phys. Lett., 2000, 322, 1-2, 97, https://doi.org/10.1016/S0009-2614(00)00384-5 . [all data]

Jacox, 2003
Jacox, M.E., Vibrational and electronic energy levels of polyatomic transient molecules: supplement B, J. Phys. Chem. Ref. Data, 2003, 32, 1, 1-441, https://doi.org/10.1063/1.1497629 . [all data]