CF3IF

Vibrational and/or electronic energy levels

Data compiled by: Marilyn E. Jacox

State:   X

Vib.
sym.
 No.   Approximate
 type of mode
 cm-1   Med.   Method   References

CF stretch 1223 s Ar IR Jacox, 1980
CF stretch 1197 s Ar IR Jacox, 1980
CF stretch 1052 vs Ar IR Jacox, 1980
CF3 deform. 432 m Ar IR Jacox, 1980

Additional references: Jacox, 1994, page 356; Jacox, 1985

References

Jacox, 1980
Jacox, M.E., Matrix isolation study of the reaction of fluorine atoms with the trifluoromethyl halides, Infrared spectroscopic evidence for the CF3XF free radicals, Chem. Phys., 1980, 51, 1-2, 69, https://doi.org/10.1016/0301-0104(80)80081-4 . [all data]

Jacox, 1994
Jacox, M.E., Vibrational and electronic energy levels of polyatomic transient molecules, American Chemical Society, Washington, DC, 1994, 464. [all data]

Jacox, 1985
Jacox, M.E., Reaction of F atoms with the methyl halides. Vibrational spectra of CH3XF and of H2CX•••HF trapped in solid argon, J. Chem. Phys., 1985, 83, 7, 3255, https://doi.org/10.1063/1.449184 . [all data]