CuCN-

Vibrational and/or electronic energy levels

Data compiled by: Marilyn E. Jacox

State:   ?

 Energy
 (cm-1
 Med.   Transition   λmin
 (nm)
 λmax
 (nm)

References

Td = 11830 ± 80 gas Boldyrev, Li, et al., 2000
Negishi, Yasuike, et al., 2000

Additional references: Jacox, 2003, page 64

Boldyrev, Li, et al., 2000
Boldyrev, A.I.; Li, X.; Wang, L.-S., Vibrationally resolved photoelectron spectra of CuCN- and AgCN- and ab initio studies of the structure and bonding in CuCN, J. Chem. Phys., 2000, 112, 8, 3627, https://doi.org/10.1063/1.480516 . [all data]

Negishi, Yasuike, et al., 2000
Negishi, Y.; Yasuike, T.; Hayakawa, F.; Kizawa, M.; Yabushita, S.; Nakajima, A.; Kaya, K., Photoelectron spectroscopy of copper cyanide cluster anions: On the possibility of linear and ring structures, J. Chem. Phys., 2000, 113, 5, 1725, https://doi.org/10.1063/1.481974 . [all data]

Jacox, 2003
Jacox, M.E., Vibrational and electronic energy levels of polyatomic transient molecules: supplement B, J. Phys. Chem. Ref. Data, 2003, 32, 1, 1-441, https://doi.org/10.1063/1.1497629 . [all data]