CoCO-
- Formula: CCoO-
- Molecular weight: 86.9438

Vibrational and/or electronic energy levels

Data compiled by: Marilyn E. Jacox
State: X
Vib. sym. |
No. | Approximate type of mode |
cm-1 | Med. | Method | References | |
---|---|---|---|---|---|---|---|
Σ+ | 1 | CO stretch | 1820.2 | Ne | IR | Zhou and Andrews, 1999 | |
1 | CO stretch | 1804.0 | Ar | IR | Zhou and Andrews, 1998 | ||
Additional references: Jacox, 2003, page 86

References

Zhou and Andrews, 1999
Zhou, M.; Andrews, L.,
Reactions of Laser-Ablated Co, Rh, and Ir with CO: Infrared Spectra and Density Functional Calculations of the Metal Carbonyl Molecules, Cations and Anions in Solid Neon,
J. Phys. Chem. A, 1999, 103, 39, 7773, https://doi.org/10.1021/jp991400f
. [all data]
Zhou and Andrews, 1998
Zhou, M.; Andrews, L.,
Reactions of Laser-Ablated Niobium and Tantalum Atoms with NO. Infrared Spectra of the NMO, M(η,
J. Phys. Chem. A, 1998, 102, 49, 10025, https://doi.org/10.1021/jp983392t
. [all data]
Jacox, 2003
Jacox, M.E.,
Vibrational and electronic energy levels of polyatomic transient molecules: supplement B,
J. Phys. Chem. Ref. Data, 2003, 32, 1, 1-441, https://doi.org/10.1063/1.1497629
. [all data]