CF3BrF

Vibrational and/or electronic energy levels

Data compiled by: Marilyn E. Jacox

State:   X

Vib.
sym.
 No.   Approximate
 type of mode
 cm-1   Med.   Method   References

CF stretch 1251 s Ar IR Jacox, 1980
CF stretch 1225 s Ar IR Jacox, 1980
CF stretch 1051 vs Ar IR Jacox, 1980
BrF stretch 588 w m Ar IR Jacox, 1980
CF3 deform. 454 w m Ar IR Jacox, 1980

Additional references: Jacox, 1994, page 356

References

Jacox, 1980
Jacox, M.E., Matrix isolation study of the reaction of fluorine atoms with the trifluoromethyl halides, Infrared spectroscopic evidence for the CF3XF free radicals, Chem. Phys., 1980, 51, 1-2, 69, https://doi.org/10.1016/0301-0104(80)80081-4 . [all data]

Jacox, 1994
Jacox, M.E., Vibrational and electronic energy levels of polyatomic transient molecules, American Chemical Society, Washington, DC, 1994, 464. [all data]