BeNC

Vibrational and/or electronic energy levels

Data compiled by: Marilyn E. Jacox

State:   X

Vib.
sym.
 No.   Approximate
 type of mode
 cm-1   Med.   Method   References

1 NC stretch 2088.7 Ar IR Lanzisera and Andrews, 1997
3 BeN stretch 938.4 Ar IR Lanzisera and Andrews, 1997

Additional references: Jacox, 2003, page 58

References

Lanzisera and Andrews, 1997
Lanzisera, D.V.; Andrews, L., Reactions of Laser-Ablated Beryllium Atoms with Hydrogen Cyanide in Excess Argon. FTIR Spectra and Quantum Chemical Calculations on BeCN, BeNC, HBeCN, and HBeNC, J. Am. Chem. Soc., 1997, 119, 27, 6392, https://doi.org/10.1021/ja970740g . [all data]

Jacox, 2003
Jacox, M.E., Vibrational and electronic energy levels of polyatomic transient molecules: supplement B, J. Phys. Chem. Ref. Data, 2003, 32, 1, 1-441, https://doi.org/10.1063/1.1497629 . [all data]