BCN

Vibrational and/or electronic energy levels

Data compiled by: Marilyn E. Jacox

State:   X

Vib.
sym.
 No.   Approximate
 type of mode
 cm-1   Med.   Method   References

1 CN stretch 2170.8 Ar IR Lanzisera, Andrews, et al., 1997
3 BC stretch 800.0 Ar IR Lanzisera, Andrews, et al., 1997

Additional references: Jacox, 2003, page 78

References

Lanzisera, Andrews, et al., 1997
Lanzisera, D.V.; Andrews, L.; Taylor, P.R., Reactions of Laser-Ablated Boron Atoms with HCN during Condensation in Argon. A Comparison of Matrix Infrared and DFT, CCSD(T), and CASSCF Frequencies of BNC, BCN, HBNC, and HBCN, J. Phys. Chem. A, 1997, 101, 38, 7134, https://doi.org/10.1021/jp971116t . [all data]

Jacox, 2003
Jacox, M.E., Vibrational and electronic energy levels of polyatomic transient molecules: supplement B, J. Phys. Chem. Ref. Data, 2003, 32, 1, 1-441, https://doi.org/10.1063/1.1497629 . [all data]