Al5C

Vibrational and/or electronic energy levels

Data compiled by: Marilyn E. Jacox

State:   C

 Energy
 (cm-1
 Med.   Transition   λmin
 (nm)
 λmax
 (nm)

References

To = 11540 ± 650 gas Boldyrev, Simons, et al., 1999

State:   B

 Energy
 (cm-1
 Med.   Transition   λmin
 (nm)
 λmax
 (nm)

To = 3630 ± 580 gas Boldyrev, Simons, et al., 1999

State:   A

 Energy
 (cm-1
 Med.   Transition   λmin
 (nm)
 λmax
 (nm)

To = 1690 ± 520 gas Boldyrev, Simons, et al., 1999

Additional references: Jacox, 2003, page 325

Boldyrev, Simons, et al., 1999
Boldyrev, A.I.; Simons, J.; Li, X.; Wang, L.-S., The electronic structure and chemical bonding of hypermetallic Al[sub 5]C by ab initio calculations and anion photoelectron spectroscopy, J. Chem. Phys., 1999, 111, 11, 4993, https://doi.org/10.1063/1.479744 . [all data]

Jacox, 2003
Jacox, M.E., Vibrational and electronic energy levels of polyatomic transient molecules: supplement B, J. Phys. Chem. Ref. Data, 2003, 32, 1, 1-441, https://doi.org/10.1063/1.1497629 . [all data]