Al4C-

Vibrational and/or electronic energy levels

Data compiled by: Marilyn E. Jacox

State:   ?

 Energy
 (cm-1
 Med.   Transition   λmin
 (nm)
 λmax
 (nm)

References

Tdx = 21380 ± 480 gas Li, Wang, et al., 1999

Additional references: Jacox, 2003, page 278

Li, Wang, et al., 1999
Li, X.; Wang, L.-S.; Boldyrev, A.I.; Simons, J., Tetracoordinated Planar Carbon in the Al, J. Am. Chem. Soc., 1999, 121, 25, 6033, https://doi.org/10.1021/ja9906204 . [all data]

Jacox, 2003
Jacox, M.E., Vibrational and electronic energy levels of polyatomic transient molecules: supplement B, J. Phys. Chem. Ref. Data, 2003, 32, 1, 1-441, https://doi.org/10.1063/1.1497629 . [all data]