CAl3Si-

Vibrational and/or electronic energy levels

Data compiled by: Marilyn E. Jacox

State:   ?

 Energy
 (cm-1
 Med.   Transition   λmin
 (nm)
 λmax
 (nm)

References

Td = 22350 ± 480 gas Li, Zhai, et al., 2003

Additional references: Jacox, 2003, page 279

Li, Zhai, et al., 2003
Li, X.; Zhai, H.-J.; Wang, L.S., Photoelectron spectroscopy of pentaatomic tetracoordinate planar carbon molecules: CAl3Si- and CAl3Ge-, Chem. Phys. Lett., 2003, 357, 5-6, 415, https://doi.org/10.1016/S0009-2614(02)00488-8 . [all data]

Jacox, 2003
Jacox, M.E., Vibrational and electronic energy levels of polyatomic transient molecules: supplement B, J. Phys. Chem. Ref. Data, 2003, 32, 1, 1-441, https://doi.org/10.1063/1.1497629 . [all data]