CAl3

Vibrational and/or electronic energy levels

Data compiled by: Marilyn E. Jacox

State:   C

 Energy
 (cm-1
 Med.   Transition   λmin
 (nm)
 λmax
 (nm)

References

To = 12260 ± 290 gas Boldyrev, Simons, et al., 1999

Vib.
sym.
 No.   Approximate
 type of mode
 cm-1   Med.   Method   References

440 ± 50 gas PE Boldyrev, Simons, et al., 1999

State:   B

 Energy
 (cm-1
 Med.   Transition   λmin
 (nm)
 λmax
 (nm)

To = 5410 ± 510 gas Boldyrev, Simons, et al., 1999

State:   A

 Energy
 (cm-1
 Med.   Transition   λmin
 (nm)
 λmax
 (nm)

To = 1050 ± 360 gas Boldyrev, Simons, et al., 1999

Vib.
sym.
 No.   Approximate
 type of mode
 cm-1   Med.   Method   References

610 ± 60 gas PE Boldyrev, Simons, et al., 1999

Additional references: Jacox, 2003, page 201

Boldyrev, Simons, et al., 1999
Boldyrev, A.I.; Simons, J.; Li, X.; Chen, W.; Wang, L.-S., Combined photoelectron spectroscopy and ab initio study of the hypermetallic Al[sub 3]C molecule, J. Chem. Phys., 1999, 110, 18, 8980, https://doi.org/10.1063/1.478816 . [all data]

Jacox, 2003
Jacox, M.E., Vibrational and electronic energy levels of polyatomic transient molecules: supplement B, J. Phys. Chem. Ref. Data, 2003, 32, 1, 1-441, https://doi.org/10.1063/1.1497629 . [all data]