AlCSi

Vibrational and/or electronic energy levels

Data compiled by: Marilyn E. Jacox

State:   A

 Energy
 (cm-1
 Med.   Transition   λmin
 (nm)
 λmax
 (nm)

References

To = 4200 ± 640 gas Boldyrev, Simons, et al., 1999

Additional references: Jacox, 2003, page 63

Boldyrev, Simons, et al., 1999
Boldyrev, A.I.; Simons, J.; Li, X.; Wang, L.-S., π- and σ-Coordinated Al in AlC, J. Am. Chem. Soc., 1999, 121, 43, 10193, https://doi.org/10.1021/ja992102z . [all data]

Jacox, 2003
Jacox, M.E., Vibrational and electronic energy levels of polyatomic transient molecules: supplement B, J. Phys. Chem. Ref. Data, 2003, 32, 1, 1-441, https://doi.org/10.1063/1.1497629 . [all data]