HBeOBeH

Vibrational and/or electronic energy levels

Data compiled by: Marilyn E. Jacox

State:   X

Vib.
sym.
 No.   Approximate
 type of mode
 cm-1   Med.   Method   References

BeH stretch 2092.4 Ar IR Thompson and Andrews, 1996
BeOBe a-stretch 1403.1 Ar IR Thompson and Andrews, 1996
Deformation 578.7 Ar IR Thompson and Andrews, 1996

Additional references: Jacox, 1998, page 275

References

Thompson and Andrews, 1996
Thompson, C.A.; Andrews, L., Reactions of Laser Ablated Be Atoms with H, J. Phys. Chem., 1996, 100, 30, 12214, https://doi.org/10.1021/jp9606927 . [all data]

Jacox, 1998
Jacox, M.E., Vibrational and electronic energy levels of polyatomic transient molecules: supplement A, J. Phys. Chem. Ref. Data, 1998, 27, 2, 115-393, https://doi.org/10.1063/1.556017 . [all data]