BNBO

Vibrational and/or electronic energy levels

Data compiled by: Marilyn E. Jacox

State:   X

Vib.
sym.
 No.   Approximate
 type of mode
 cm-1   Med.   Method   References

BO stretch 2068.8 Ar IR Zhou, Tsumori, et al., 2003
Deformation 500.7 Ar IR Zhou, Tsumori, et al., 2003

References

Zhou, Tsumori, et al., 2003
Zhou, M.; Tsumori, N.; Xu, Q.; Kushto, G.P.; Andrews, L., Reactions of B Atoms and Clusters with NO: Experimental and Theoretical Characterization of Novel Molecules Containing B, N, and O, J. Am. Chem. Soc., 2003, 125, 37, 11371, https://doi.org/10.1021/ja0367187 . [all data]