HBNH2

Vibrational and/or electronic energy levels

Data compiled by: Marilyn E. Jacox

State:   X

Vib.
sym.
 No.   Approximate
 type of mode
 cm-1   Med.   Method   References

NH stretch 3598.4 Ar IR Thompson, Andrews, et al., 1995
NH stretch 3588.4 Ar IR Thompson, Andrews, et al., 1995
BH stretch 2418.2 Ar IR Thompson, Andrews, et al., 1995
BN stretch 1556.4 Ar IR Thompson, Andrews, et al., 1995
OPLA 608.5 Ar IR Thompson, Andrews, et al., 1995

Additional references: Jacox, 1998, page 269

References

Thompson, Andrews, et al., 1995
Thompson, C.A.; Andrews, L.; Martin, J.M.L.; El-Yazal, J., Infrared Spectra of Boron-Ammonia Reaction Products in Solid Argon, J. Phys. Chem., 1995, 99, 38, 13839, https://doi.org/10.1021/j100038a015 . [all data]

Jacox, 1998
Jacox, M.E., Vibrational and electronic energy levels of polyatomic transient molecules: supplement A, J. Phys. Chem. Ref. Data, 1998, 27, 2, 115-393, https://doi.org/10.1063/1.556017 . [all data]