GaBH6+

Vibrational and/or electronic energy levels

Data compiled by: Marilyn E. Jacox

State:   D

 Energy
 (cm-1
 Med.   Transition   λmin
 (nm)
 λmax
 (nm)

References

To = 34130 ± 120 gas Dyke, Haggerston, et al., 1996

Vib.
sym.
 No.   Approximate
 type of mode
 cm-1   Med.   Method   References

a1 BHt stretch 1950 ± 100 gas PE Dyke, Haggerston, et al., 1996
GaHt stretch 1480 ± 100 gas PE Dyke, Haggerston, et al., 1996

State:   C

 Energy
 (cm-1
 Med.   Transition   λmin
 (nm)
 λmax
 (nm)

Tx = 20250 ± 240 gas Dyke, Haggerston, et al., 1996

State:   B

 Energy
 (cm-1
 Med.   Transition   λmin
 (nm)
 λmax
 (nm)

Tx = 14760 ± 120 gas Dyke, Haggerston, et al., 1996

State:   A

 Energy
 (cm-1
 Med.   Transition   λmin
 (nm)
 λmax
 (nm)

Tx = 10890 ± 120 gas Dyke, Haggerston, et al., 1996

Additional references: Jacox, 1998, page 332

Dyke, Haggerston, et al., 1996
Dyke, J.M.; Haggerston, D.; Warschkow, O.; Andrews, L.; Downs, A.J.; Souter, P.F., UV Photoelectron Spectra of the μ-Hydrido Bridge-Bonded Molecules B, J. Phys. Chem., 1996, 100, 8, 2998, https://doi.org/10.1021/jp953039c . [all data]

Jacox, 1998
Jacox, M.E., Vibrational and electronic energy levels of polyatomic transient molecules: supplement A, J. Phys. Chem. Ref. Data, 1998, 27, 2, 115-393, https://doi.org/10.1063/1.556017 . [all data]